Reaction Details
TargetAurora kinase B/Inner centromere protein
LigandBDBM50198080
Substrate/Competitorn/a
Meas. Tech.ChEMBL_1620442 (CHEMBL3862725)
IC50 2700±n/a nM
Citation Kilchmann, FMarcaida, MJKotak, SSchick, TBoss, SDAwale, MGönczy, PReymond, JL Discovery of a Selective Aurora A Kinase Inhibitor by Virtual Screening. J Med Chem59:7188-211 (2016) 
 
Aurora kinase B/Inner centromere protein
Name:Aurora kinase B/Inner centromere protein
Synonyms:Aurora B/Incenp
Type:Protein Complex
Mol. Mass.:n/a
Description:n/a
Components:This complex has 2 components.
Component 1
Name:Aurora kinase B
Type:Protein
Mol. Mass.:39327.72
Organism:Homo sapiens (Human)
Description:Q96GD4
Residue:344
Component 2
Name:Inner centromere protein
Synonyms:INCENP | INCE_HUMAN
Type:Protein
Mol. Mass.:105461.33
Organism:Homo sapiens (Human)
Description:Q9NQS7
Residue:918
BDBM50198080
NameBDBM50198080
Synonyms:CHEMBL3932394
TypeSmall organic molecule
Emp. Form.C21H20N4O4S
Mol. Mass.424.473
SMILESCCc1ccc(cc1)\N=C1/S\C(=C/c2ccnc(NC(=O)CC(O)=O)c2)C(=O)N1C