Reaction Details
TargetAurora kinase A
LigandBDBM50198086
Substrate/Competitorn/a
Meas. Tech.ChEMBL_1620440 (CHEMBL3862723)
IC50 6.2±n/a nM
Citation Kilchmann, FMarcaida, MJKotak, SSchick, TBoss, SDAwale, MGönczy, PReymond, JL Discovery of a Selective Aurora A Kinase Inhibitor by Virtual Screening. J Med Chem59:7188-211 (2016) 
 
Aurora kinase A
Name:Aurora kinase A
Type:Serine/threonine-protein kinase
Mol. Mass.:45830.98
Organism:Homo sapiens (Human)
Description:O14965
Residue:403
BDBM50198086
NameBDBM50198086
Synonyms:CHEMBL3985313
TypeSmall organic molecule
Emp. Form.C23H24N4O4S
Mol. Mass.452.526
SMILESCCc1ccc(cc1)\N=C1/S\C(=C/c2ccnc(NC(=O)CCCC(O)=O)c2)C(=O)N1C