Reaction Details
TargetAurora kinase A
LigandBDBM50198162
Substrate/Competitorn/a
Meas. Tech.ChEMBL_1620440 (CHEMBL3862723)
IC50 780±n/a nM
Citation Kilchmann, FMarcaida, MJKotak, SSchick, TBoss, SDAwale, MGönczy, PReymond, JL Discovery of a Selective Aurora A Kinase Inhibitor by Virtual Screening. J Med Chem59:7188-211 (2016) 
 
Aurora kinase A
Name:Aurora kinase A
Type:Serine/threonine-protein kinase
Mol. Mass.:45830.98
Organism:Homo sapiens (Human)
Description:O14965
Residue:403
BDBM50198162
NameBDBM50198162
Synonyms:CHEMBL3938394
TypeSmall organic molecule
Emp. Form.C19H19N3OS
Mol. Mass.337.439
SMILESCC(C)c1ccc(cc1)\N=C1/S\C(=C/c2ccncc2)C(=O)N1C