Reaction Details
TargetTelomerase reverse transcriptase
LigandBDBM50198341
Substrate/Competitorn/a
Meas. Tech.ChEMBL_1620676 (CHEMBL3862959)
IC50 13±n/a nM
Citation Fuggetta, MPDe Mico, ACottarelli, AMorelli, FZonfrillo, MUlgheri, FPeluso, PMannu, ADeligia, FMarchetti, MRoviello, GReyes Romero, ADömling, ASpanu, P Synthesis and Enantiomeric Separation of a Novel Spiroketal Derivative: A Potent Human Telomerase Inhibitor with High in Vitro Anticancer Activity. J Med Chem59:9140-9149 (2016) 
 
Telomerase reverse transcriptase
Name:Telomerase reverse transcriptase
Type:PROTEIN
Mol. Mass.:127099.03
Organism:Homo sapiens (Human)
Description:ChEMBL_1447029
Residue:1132
BDBM50198341
NameBDBM50198341
Synonyms:CHEMBL3948172
TypeSmall organic molecule
Emp. Form.C10H14O4
Mol. Mass.198.2158
SMILESCC1CCCC2(O1)OC(O)C=CC2=O