Reaction Details
TargetProtein polybromo-1
LigandBDBM50198451
Substrate/Competitorn/a
Meas. Tech.ChEBML_1620730
Kd 3400±n/a nM
Citation Myrianthopoulos, VGaboriaud-Kolar, NTallant, CHall, MLGrigoriou, SBrownlee, PMFedorov, ORogers, CHeidenreich, DWanior, MDrosos, NMexia, NSavitsky, PBagratuni, TKastritis, ETerpos, EFilippakopoulos, PMüller, SSkaltsounis, ALDowns, JAKnapp, SMikros, E Discovery and Optimization of a Selective Ligand for the Switch/Sucrose Nonfermenting-Related Bromodomains of Polybromo Protein-1 by the Use of Virtual Screening and Hydration Analysis. J Med Chem59:8787-8803 (2016) 
 
Protein polybromo-1
Name:Protein polybromo-1
Type:PROTEIN
Mol. Mass.:192953.62
Organism:Homo sapiens (Human)
Description:ChEMBL_104264
Residue:1689
BDBM50198451
NameBDBM50198451
Synonyms:CHEMBL1491707
TypeSmall organic molecule
Emp. Form.C11H9N3
Mol. Mass.183.2093
SMILESCc1nnc2ccc3ccccc3n12