Reaction Details
TargetProtein polybromo-1
LigandBDBM50198450
Substrate/Competitorn/a
Meas. Tech.ChEBML_1620730
Kd 5100±n/a nM
Citation Myrianthopoulos, VGaboriaud-Kolar, NTallant, CHall, MLGrigoriou, SBrownlee, PMFedorov, ORogers, CHeidenreich, DWanior, MDrosos, NMexia, NSavitsky, PBagratuni, TKastritis, ETerpos, EFilippakopoulos, PMüller, SSkaltsounis, ALDowns, JAKnapp, SMikros, E Discovery and Optimization of a Selective Ligand for the Switch/Sucrose Nonfermenting-Related Bromodomains of Polybromo Protein-1 by the Use of Virtual Screening and Hydration Analysis. J Med Chem59:8787-8803 (2016) 
 
Protein polybromo-1
Name:Protein polybromo-1
Type:PROTEIN
Mol. Mass.:192953.62
Organism:Homo sapiens (Human)
Description:ChEMBL_104264
Residue:1689
BDBM50198450
NameBDBM50198450
Synonyms:CHEMBL3927964
TypeSmall organic molecule
Emp. Form.C14H14N2O2
Mol. Mass.242.2732
SMILESCCCCc1[nH]nc2oc(=O)c3ccccc3c12