Reaction Details
TargetMicrotubule-associated protein tau
LigandBDBM50198622
Substrate/Competitorn/a
Meas. Tech.ChEBML_1620755
IC50 700±n/a nM
Citation Okuda, MHijikuro, IFujita, YTeruya, TKawakami, HTakahashi, TSugimoto, H Design and synthesis of curcumin derivatives as tau and amyloidß dual aggregation inhibitors. Bioorg Med Chem Lett26:5024-5028 (2016) 
 
Microtubule-associated protein tau
Name:Microtubule-associated protein tau
Type:Protein
Mol. Mass.:78928.63
Organism:Homo sapiens (Human)
Description:P10636
Residue:758
BDBM50198622
NameBDBM50198622
Synonyms:CHEMBL3965306
TypeSmall organic molecule
Emp. Form.C23H21NO4
Mol. Mass.375.4171
SMILESCOc1ccc(\C=C\C(=O)CC(=O)\C=C\c2ccc3cc[nH]c3c2)c(OC)c1