Reaction Details
TargetMicrotubule-associated protein tau
LigandBDBM50198628
Substrate/Competitorn/a
Meas. Tech.ChEBML_1620755
IC50 690±n/a nM
Citation Okuda, MHijikuro, IFujita, YTeruya, TKawakami, HTakahashi, TSugimoto, H Design and synthesis of curcumin derivatives as tau and amyloidß dual aggregation inhibitors. Bioorg Med Chem Lett26:5024-5028 (2016) 
 
Microtubule-associated protein tau
Name:Microtubule-associated protein tau
Type:Protein
Mol. Mass.:78928.63
Organism:Homo sapiens (Human)
Description:P10636
Residue:758
BDBM50198628
NameBDBM50198628
Synonyms:CHEMBL3986412
TypeSmall organic molecule
Emp. Form.C21H20O6
Mol. Mass.368.3799
SMILESCOc1cccc(\C=C\C(=O)CC(=O)\C=C\c2ccc(O)c(OC)c2)c1O