Reaction Details
TargetCannabinoid receptor 1
LigandBDBM50198685
Substrate/Competitorn/a
Meas. Tech.ChEMBL_1620882 (CHEMBL3863165)
EC50 7.0±n/a nM
Citation Matthews, JMMcNally, JJConnolly, PJXia, MZhu, BBlack, SChen, CHou, CLiang, YTang, YMacielag, MJ Tetrahydroindazole derivatives as potent and peripherally selective cannabinoid-1 (CB1) receptor inverse agonists. Bioorg Med Chem Lett26:5346-5349 (2016) 
 
Cannabinoid receptor 1
Name:Cannabinoid receptor 1
Type:G Protein-Coupled Receptor (GPCR)
Mol. Mass.:52868.96
Organism:Homo sapiens (Human)
Description:P21554
Residue:472
BDBM50198685
NameBDBM50198685
Synonyms:CHEMBL3930886
TypeSmall organic molecule
Emp. Form.C29H24Cl2N4O
Mol. Mass.515.433
SMILESClc1ccc(\C=C2/CCCc3c(nn(c23)-c2ccc(Cl)cc2)C(=O)NC2(CC2)c2ccccn2)cc1