Reaction Details
TargetCannabinoid receptor 2
LigandBDBM50198694
Substrate/Competitorn/a
Meas. Tech.ChEMBL_1620883 (CHEMBL3863166)
EC50 560±n/a nM
Citation Matthews, JMMcNally, JJConnolly, PJXia, MZhu, BBlack, SChen, CHou, CLiang, YTang, YMacielag, MJ Tetrahydroindazole derivatives as potent and peripherally selective cannabinoid-1 (CB1) receptor inverse agonists. Bioorg Med Chem Lett26:5346-5349 (2016) 
 
Cannabinoid receptor 2
Name:Cannabinoid receptor 2
Type:G Protein-Coupled Receptor (GPCR)
Mol. Mass.:39690.94
Organism:Homo sapiens (Human)
Description:P34972
Residue:360
BDBM50198694
NameBDBM50198694
Synonyms:CHEMBL3914883
TypeSmall organic molecule
Emp. Form.C28H24Cl3N5O
Mol. Mass.552.882
SMILESC[C@@H](NC(=O)c1nn(c2c1CCCC\C2=C/c1ccc(Cl)cn1)-c1ccc(Cl)cc1Cl)c1ccccn1