Reaction Details
TargetCannabinoid receptor 1
LigandBDBM50198687
Substrate/Competitorn/a
Meas. Tech.ChEMBL_1620882 (CHEMBL3863165)
EC50 28±n/a nM
Citation Matthews, JMMcNally, JJConnolly, PJXia, MZhu, BBlack, SChen, CHou, CLiang, YTang, YMacielag, MJ Tetrahydroindazole derivatives as potent and peripherally selective cannabinoid-1 (CB1) receptor inverse agonists. Bioorg Med Chem Lett26:5346-5349 (2016) 
 
Cannabinoid receptor 1
Name:Cannabinoid receptor 1
Type:G Protein-Coupled Receptor (GPCR)
Mol. Mass.:52868.96
Organism:Homo sapiens (Human)
Description:P21554
Residue:472
BDBM50198687
NameBDBM50198687
Synonyms:CHEMBL3959009
TypeSmall organic molecule
Emp. Form.C29H26ClFN4O
Mol. Mass.500.994
SMILESC[C@@H](NC(=O)c1nn(c2c1CCCC\C2=C/c1ccc(F)cc1)-c1ccc(Cl)cc1)c1ccccn1