Reaction Details
TargetCannabinoid receptor 1
LigandBDBM50198704
Substrate/Competitorn/a
Meas. Tech.ChEMBL_1620882 (CHEMBL3863165)
EC50 2.0±n/a nM
Citation Matthews, JMMcNally, JJConnolly, PJXia, MZhu, BBlack, SChen, CHou, CLiang, YTang, YMacielag, MJ Tetrahydroindazole derivatives as potent and peripherally selective cannabinoid-1 (CB1) receptor inverse agonists. Bioorg Med Chem Lett26:5346-5349 (2016) 
 
Cannabinoid receptor 1
Name:Cannabinoid receptor 1
Type:G Protein-Coupled Receptor (GPCR)
Mol. Mass.:52868.96
Organism:Homo sapiens (Human)
Description:P21554
Residue:472
BDBM50198704
NameBDBM50198704
Synonyms:CHEMBL3964744
TypeSmall organic molecule
Emp. Form.C27H23Cl3N4OS
Mol. Mass.557.922
SMILESC[C@@H](NC(=O)c1nn(c2c1CCCC\C2=C/c1ccc(Cl)s1)-c1ccc(Cl)cc1Cl)c1ccccn1