Reaction Details
TargetCannabinoid receptor 1
LigandBDBM50198720
Substrate/Competitorn/a
Meas. Tech.ChEMBL_1620882 (CHEMBL3863165)
EC50 12±n/a nM
Citation Matthews, JMMcNally, JJConnolly, PJXia, MZhu, BBlack, SChen, CHou, CLiang, YTang, YMacielag, MJ Tetrahydroindazole derivatives as potent and peripherally selective cannabinoid-1 (CB1) receptor inverse agonists. Bioorg Med Chem Lett26:5346-5349 (2016) 
 
Cannabinoid receptor 1
Name:Cannabinoid receptor 1
Type:G Protein-Coupled Receptor (GPCR)
Mol. Mass.:52868.96
Organism:Homo sapiens (Human)
Description:P21554
Residue:472
BDBM50198720
NameBDBM50198720
Synonyms:CHEMBL3895507
TypeSmall organic molecule
Emp. Form.C31H28Cl2FN5O
Mol. Mass.576.491
SMILESFc1ccc(\C=C2/CCCc3c(nn(c23)-c2ccc(Cl)cc2Cl)C(=O)NC2CCN(CC2)c2ccccn2)cc1