Reaction Details
TargetCannabinoid receptor 1
LigandBDBM50198719
Substrate/Competitorn/a
Meas. Tech.ChEMBL_1620882 (CHEMBL3863165)
EC50 11±n/a nM
Citation Matthews, JMMcNally, JJConnolly, PJXia, MZhu, BBlack, SChen, CHou, CLiang, YTang, YMacielag, MJ Tetrahydroindazole derivatives as potent and peripherally selective cannabinoid-1 (CB1) receptor inverse agonists. Bioorg Med Chem Lett26:5346-5349 (2016) 
 
Cannabinoid receptor 1
Name:Cannabinoid receptor 1
Type:G Protein-Coupled Receptor (GPCR)
Mol. Mass.:52868.96
Organism:Homo sapiens (Human)
Description:P21554
Residue:472
BDBM50198719
NameBDBM50198719
Synonyms:CHEMBL3962373
TypeSmall organic molecule
Emp. Form.C28H21Cl2F3N4OS
Mol. Mass.589.459
SMILESFC(F)(F)c1ccc(c(Cl)c1)-n1nc(C(=O)NC2(CC2)c2ccccn2)c2CCC\C(=C/c3ccc(Cl)s3)c12