Reaction Details
TargetCannabinoid receptor 2
LigandBDBM50198721
Substrate/Competitorn/a
Meas. Tech.ChEMBL_1620897 (CHEMBL3863180)
EC50 3240±n/a nM
Citation Zhu, BMatthews, JMXia, MBlack, SChen, CHou, CLiang, YTang, YMacielag, MJ Tetrahydropyrazolo[4,3-c]pyridine derivatives as potent and peripherally selective cannabinoid-1 (CB1) receptor inverse agonists. Bioorg Med Chem Lett26:5597-5601 (2016) 
 
Cannabinoid receptor 2
Name:Cannabinoid receptor 2
Type:G Protein-Coupled Receptor (GPCR)
Mol. Mass.:39690.94
Organism:Homo sapiens (Human)
Description:P34972
Residue:360
BDBM50198721
NameBDBM50198721
Synonyms:CHEMBL3920504
TypeSmall organic molecule
Emp. Form.C31H25Cl2FN8O2
Mol. Mass.631.487
SMILESC[C@@H](NC(=O)c1nn(c2c1CN(C\C2=C/c1ccc(F)cc1)C(=O)Cn1cnnn1)-c1ccc(Cl)cc1Cl)c1ccccc1