Reaction Details
TargetCannabinoid receptor 2
LigandBDBM50198722
Substrate/Competitorn/a
Meas. Tech.ChEMBL_1620897 (CHEMBL3863180)
EC50>10000±n/a nM
Citation Zhu, BMatthews, JMXia, MBlack, SChen, CHou, CLiang, YTang, YMacielag, MJ Tetrahydropyrazolo[4,3-c]pyridine derivatives as potent and peripherally selective cannabinoid-1 (CB1) receptor inverse agonists. Bioorg Med Chem Lett26:5597-5601 (2016) 
 
Cannabinoid receptor 2
Name:Cannabinoid receptor 2
Type:G Protein-Coupled Receptor (GPCR)
Mol. Mass.:39690.94
Organism:Homo sapiens (Human)
Description:P34972
Residue:360
BDBM50198722
NameBDBM50198722
Synonyms:CHEMBL3915676
TypeSmall organic molecule
Emp. Form.C31H25Cl2N7O2
Mol. Mass.598.482
SMILESC[C@@H](NC(=O)c1nn(c2c1CN(C\C2=C/c1ccc(Cl)cc1)C(=O)c1nc[nH]n1)-c1ccc(Cl)cc1)c1ccccc1