Reaction Details
TargetCannabinoid receptor 1
LigandBDBM50198732
Substrate/Competitorn/a
Meas. Tech.ChEMBL_1620896 (CHEMBL3863179)
EC50 7.0±n/a nM
Citation Zhu, BMatthews, JMXia, MBlack, SChen, CHou, CLiang, YTang, YMacielag, MJ Tetrahydropyrazolo[4,3-c]pyridine derivatives as potent and peripherally selective cannabinoid-1 (CB1) receptor inverse agonists. Bioorg Med Chem Lett26:5597-5601 (2016) 
 
Cannabinoid receptor 1
Name:Cannabinoid receptor 1
Type:G Protein-Coupled Receptor (GPCR)
Mol. Mass.:52868.96
Organism:Homo sapiens (Human)
Description:P21554
Residue:472
BDBM50198732
NameBDBM50198732
Synonyms:CHEMBL3976516
TypeSmall organic molecule
Emp. Form.C30H24Cl2FN9O2
Mol. Mass.632.475
SMILESC[C@@H](NC(=O)c1nn(c2c1CN(C\C2=C/c1ccc(F)cc1)C(=O)Cn1cnnn1)-c1ccc(Cl)c(Cl)c1)c1ccccn1