Reaction Details
TargetCannabinoid receptor 1
LigandBDBM50198737
Substrate/Competitorn/a
Meas. Tech.ChEMBL_1620896 (CHEMBL3863179)
EC50 6.0±n/a nM
Citation Zhu, BMatthews, JMXia, MBlack, SChen, CHou, CLiang, YTang, YMacielag, MJ Tetrahydropyrazolo[4,3-c]pyridine derivatives as potent and peripherally selective cannabinoid-1 (CB1) receptor inverse agonists. Bioorg Med Chem Lett26:5597-5601 (2016) 
 
Cannabinoid receptor 1
Name:Cannabinoid receptor 1
Type:G Protein-Coupled Receptor (GPCR)
Mol. Mass.:52868.96
Organism:Homo sapiens (Human)
Description:P21554
Residue:472
BDBM50198737
NameBDBM50198737
Synonyms:CHEMBL3939540
TypeSmall organic molecule
Emp. Form.C32H28Cl2N8O3
Mol. Mass.643.523
SMILESCOc1ccc(\C=C2/CN(Cc3c(nn(c23)-c2ccc(Cl)cc2Cl)C(=O)N[C@H](C)c2ccccc2)C(=O)Cn2cnnn2)cc1