Reaction Details
TargetCDGSH iron-sulfur domain-containing protein 1
LigandBDBM138364
Substrate/Competitorn/a
Meas. Tech.ChEMBL_1620948 (CHEMBL3863231)
Ki 297±n/a nM
Citation Geldenhuys, WJYonutas, HMMorris, DLSullivan, PGDarvesh, ASLeeper, TC Identification of small molecules that bind to the mitochondrial protein mitoNEET. Bioorg Med Chem Lett26:5350-5353 (2016) 
 
CDGSH iron-sulfur domain-containing protein 1
Name:CDGSH iron-sulfur domain-containing protein 1
Type:PROTEIN
Mol. Mass.:12206.48
Organism:Homo sapiens (Human)
Description:ChEMBL_766432
Residue:108
BDBM138364
NameBDBM138364
Synonyms:US10278929, Compound 12 US8877795, 12
TypeSmall organic molecule
Emp. Form.C11H6F3NO2S
Mol. Mass.273.231
SMILESFC(F)(F)c1cccc(\C=C2/SC(=O)NC2=O)c1