Reaction Details
TargetCDGSH iron-sulfur domain-containing protein 1
LigandBDBM50198764
Substrate/Competitorn/a
Meas. Tech.ChEMBL_1620948 (CHEMBL3863231)
Ki 52±n/a nM
Citation Geldenhuys, WJYonutas, HMMorris, DLSullivan, PGDarvesh, ASLeeper, TC Identification of small molecules that bind to the mitochondrial protein mitoNEET. Bioorg Med Chem Lett26:5350-5353 (2016) 
 
CDGSH iron-sulfur domain-containing protein 1
Name:CDGSH iron-sulfur domain-containing protein 1
Type:PROTEIN
Mol. Mass.:12206.48
Organism:Homo sapiens (Human)
Description:ChEMBL_766432
Residue:108
BDBM50198764
NameBDBM50198764
Synonyms:CHEMBL3909388
TypeSmall organic molecule
Emp. Form.C17H15NO2
Mol. Mass.265.3065
SMILESCN(C)c1ccc(\C=C2\Oc3ccccc3C2=O)cc1