Reaction Details
TargetCDGSH iron-sulfur domain-containing protein 1
LigandBDBM50198766
Substrate/Competitorn/a
Meas. Tech.ChEMBL_1620948 (CHEMBL3863231)
Ki 141±n/a nM
Citation Geldenhuys, WJYonutas, HMMorris, DLSullivan, PGDarvesh, ASLeeper, TC Identification of small molecules that bind to the mitochondrial protein mitoNEET. Bioorg Med Chem Lett26:5350-5353 (2016) 
 
CDGSH iron-sulfur domain-containing protein 1
Name:CDGSH iron-sulfur domain-containing protein 1
Type:PROTEIN
Mol. Mass.:12206.48
Organism:Homo sapiens (Human)
Description:ChEMBL_766432
Residue:108
BDBM50198766
NameBDBM50198766
Synonyms:CHEMBL3982310
TypeSmall organic molecule
Emp. Form.C23H20N2O6S
Mol. Mass.452.48
SMILESCOc1cccc2CC(Oc12)C(=O)C1=C(O)C(=O)N(C1c1ccco1)c1nc(C)c(C)s1