Reaction Details
TargetCDGSH iron-sulfur domain-containing protein 1
LigandBDBM50241153
Substrate/Competitorn/a
Meas. Tech.ChEMBL_1620947 (CHEMBL3863230)
IC50 3180±n/a nM
Citation Geldenhuys, WJYonutas, HMMorris, DLSullivan, PGDarvesh, ASLeeper, TC Identification of small molecules that bind to the mitochondrial protein mitoNEET. Bioorg Med Chem Lett26:5350-5353 (2016) 
 
CDGSH iron-sulfur domain-containing protein 1
Name:CDGSH iron-sulfur domain-containing protein 1
Type:PROTEIN
Mol. Mass.:12206.48
Organism:Homo sapiens (Human)
Description:ChEMBL_766432
Residue:108
BDBM50241153
NameBDBM50241153
Synonyms:(Z)-5-(4'-Bromobenzylidene)-2-thioxothiazolidin-4-one CHEMBL224467
TypeSmall organic molecule
Emp. Form.C10H6BrNOS2
Mol. Mass.300.195
SMILESSC1=NC(=O)C(S1)=Cc1ccc(Br)cc1