Reaction Details
TargetCDGSH iron-sulfur domain-containing protein 1
LigandBDBM57045
Substrate/Competitorn/a
Meas. Tech.ChEMBL_1620947 (CHEMBL3863230)
IC50 19100±n/a nM
Citation Geldenhuys, WJYonutas, HMMorris, DLSullivan, PGDarvesh, ASLeeper, TC Identification of small molecules that bind to the mitochondrial protein mitoNEET. Bioorg Med Chem Lett26:5350-5353 (2016) 
 
CDGSH iron-sulfur domain-containing protein 1
Name:CDGSH iron-sulfur domain-containing protein 1
Type:PROTEIN
Mol. Mass.:12206.48
Organism:Homo sapiens (Human)
Description:ChEMBL_766432
Residue:108
BDBM57045
NameBDBM57045
Synonyms:MLS000028500 SMR000058271 | cid_4509
TypeSmall organic molecule
Emp. Form.C8H6N4O5
Mol. Mass.238.157
SMILES[O-][N+](=O)c1ccc(\C=N\N2CC(=O)NC2=O)o1