Reaction Details
TargetCDGSH iron-sulfur domain-containing protein 1
LigandBDBM50198773
Substrate/Competitorn/a
Meas. Tech.ChEMBL_1620947 (CHEMBL3863230)
IC50 1800±n/a nM
Citation Geldenhuys, WJYonutas, HMMorris, DLSullivan, PGDarvesh, ASLeeper, TC Identification of small molecules that bind to the mitochondrial protein mitoNEET. Bioorg Med Chem Lett26:5350-5353 (2016) 
 
CDGSH iron-sulfur domain-containing protein 1
Name:CDGSH iron-sulfur domain-containing protein 1
Type:PROTEIN
Mol. Mass.:12206.48
Organism:Homo sapiens (Human)
Description:ChEMBL_766432
Residue:108
BDBM50198773
NameBDBM50198773
Synonyms:CHEMBL2218926
TypeSmall organic molecule
Emp. Form.C14H13BrN2O
Mol. Mass.305.17
SMILES[#6]C([#6])([#6])c1cc(\[#6]=[#6](\C#N)C#N)cc(Br)c1-[#8]