Reaction Details
TargetCDGSH iron-sulfur domain-containing protein 1
LigandBDBM50198774
Substrate/Competitorn/a
Meas. Tech.ChEMBL_1620948 (CHEMBL3863231)
Ki 165±n/a nM
Citation Geldenhuys, WJYonutas, HMMorris, DLSullivan, PGDarvesh, ASLeeper, TC Identification of small molecules that bind to the mitochondrial protein mitoNEET. Bioorg Med Chem Lett26:5350-5353 (2016) 
 
CDGSH iron-sulfur domain-containing protein 1
Name:CDGSH iron-sulfur domain-containing protein 1
Type:PROTEIN
Mol. Mass.:12206.48
Organism:Homo sapiens (Human)
Description:ChEMBL_766432
Residue:108
BDBM50198774
NameBDBM50198774
Synonyms:CHEMBL3927255
TypeSmall organic molecule
Emp. Form.C10H6BrNO3S
Mol. Mass.300.129
SMILESOc1ccc(\C=C2/SC(=O)NC2=O)cc1Br