Reaction Details
TargetCDGSH iron-sulfur domain-containing protein 1
LigandBDBM50181712
Substrate/Competitorn/a
Meas. Tech.ChEMBL_1620948 (CHEMBL3863231)
Ki 213±n/a nM
Citation Geldenhuys, WJYonutas, HMMorris, DLSullivan, PGDarvesh, ASLeeper, TC Identification of small molecules that bind to the mitochondrial protein mitoNEET. Bioorg Med Chem Lett26:5350-5353 (2016) 
 
CDGSH iron-sulfur domain-containing protein 1
Name:CDGSH iron-sulfur domain-containing protein 1
Type:PROTEIN
Mol. Mass.:12206.48
Organism:Homo sapiens (Human)
Description:ChEMBL_766432
Residue:108
BDBM50181712
NameBDBM50181712
Synonyms:(Z)-5-(4'-Chlorobenzylidene)-3-methyl-2-thioxothiazolidin-4-one CHEMBL380899
TypeSmall organic molecule
Emp. Form.C11H8ClNOS2
Mol. Mass.269.77
SMILESCN1C(=S)S\C(=C/c2ccc(Cl)cc2)C1=O