Reaction Details
TargetCDGSH iron-sulfur domain-containing protein 1
LigandBDBM50198881
Substrate/Competitorn/a
Meas. Tech.ChEMBL_1620948 (CHEMBL3863231)
Ki 37±n/a nM
Citation Geldenhuys, WJYonutas, HMMorris, DLSullivan, PGDarvesh, ASLeeper, TC Identification of small molecules that bind to the mitochondrial protein mitoNEET. Bioorg Med Chem Lett26:5350-5353 (2016) 
 
CDGSH iron-sulfur domain-containing protein 1
Name:CDGSH iron-sulfur domain-containing protein 1
Type:PROTEIN
Mol. Mass.:12206.48
Organism:Homo sapiens (Human)
Description:ChEMBL_766432
Residue:108
BDBM50198881
NameBDBM50198881
Synonyms:CHEMBL496587
TypeSmall organic molecule
Emp. Form.C10H6BrNO2S
Mol. Mass.284.129
SMILESBrc1cccc(\C=C2/SC(=O)NC2=O)c1