Reaction Details
TargetCDGSH iron-sulfur domain-containing protein 1
LigandBDBM50198896
Substrate/Competitorn/a
Meas. Tech.ChEMBL_1620948 (CHEMBL3863231)
Ki 341±n/a nM
Citation Geldenhuys, WJYonutas, HMMorris, DLSullivan, PGDarvesh, ASLeeper, TC Identification of small molecules that bind to the mitochondrial protein mitoNEET. Bioorg Med Chem Lett26:5350-5353 (2016) 
 
CDGSH iron-sulfur domain-containing protein 1
Name:CDGSH iron-sulfur domain-containing protein 1
Type:PROTEIN
Mol. Mass.:12206.48
Organism:Homo sapiens (Human)
Description:ChEMBL_766432
Residue:108
BDBM50198896
NameBDBM50198896
Synonyms:CHEMBL3917957
TypeSmall organic molecule
Emp. Form.C19H14ClFN2O3S
Mol. Mass.404.842
SMILESCC(=O)NC1=NC(=O)\C(S1)=C/c1ccc(OCc2cccc(F)c2)c(Cl)c1