Reaction Details
TargetCDGSH iron-sulfur domain-containing protein 1
LigandBDBM50198769
Substrate/Competitorn/a
Meas. Tech.ChEMBL_1620948 (CHEMBL3863231)
Ki 145±n/a nM
Citation Geldenhuys, WJYonutas, HMMorris, DLSullivan, PGDarvesh, ASLeeper, TC Identification of small molecules that bind to the mitochondrial protein mitoNEET. Bioorg Med Chem Lett26:5350-5353 (2016) 
 
CDGSH iron-sulfur domain-containing protein 1
Name:CDGSH iron-sulfur domain-containing protein 1
Type:PROTEIN
Mol. Mass.:12206.48
Organism:Homo sapiens (Human)
Description:ChEMBL_766432
Residue:108
BDBM50198769
NameBDBM50198769
Synonyms:CHEBI:72761 | TRYPROSTATIN A
TypeSmall organic molecule
Emp. Form.C22H27N3O3
Mol. Mass.381.4681
SMILES[H][C@@]12CCCN1C(=O)[C@]([H])(Cc1c(CC=C(C)C)[nH]c3cc(OC)ccc13)NC2=O