Reaction Details
TargetCDGSH iron-sulfur domain-containing protein 1
LigandBDBM50198898
Substrate/Competitorn/a
Meas. Tech.ChEMBL_1620947 (CHEMBL3863230)
IC50 686±n/a nM
Citation Geldenhuys, WJYonutas, HMMorris, DLSullivan, PGDarvesh, ASLeeper, TC Identification of small molecules that bind to the mitochondrial protein mitoNEET. Bioorg Med Chem Lett26:5350-5353 (2016) 
 
CDGSH iron-sulfur domain-containing protein 1
Name:CDGSH iron-sulfur domain-containing protein 1
Type:PROTEIN
Mol. Mass.:12206.48
Organism:Homo sapiens (Human)
Description:ChEMBL_766432
Residue:108
BDBM50198898
NameBDBM50198898
Synonyms:CHEMBL3970270
TypeSmall organic molecule
Emp. Form.C21H21NO4S
Mol. Mass.383.461
SMILESCCc1ccc(OCCCOc2ccc(\C=C3\SC(=O)NC3=O)cc2)cc1