Reaction Details
TargetCDGSH iron-sulfur domain-containing protein 1
LigandBDBM50198899
Substrate/Competitorn/a
Meas. Tech.ChEMBL_1620947 (CHEMBL3863230)
IC50 2930±n/a nM
Citation Geldenhuys, WJYonutas, HMMorris, DLSullivan, PGDarvesh, ASLeeper, TC Identification of small molecules that bind to the mitochondrial protein mitoNEET. Bioorg Med Chem Lett26:5350-5353 (2016) 
 
CDGSH iron-sulfur domain-containing protein 1
Name:CDGSH iron-sulfur domain-containing protein 1
Type:PROTEIN
Mol. Mass.:12206.48
Organism:Homo sapiens (Human)
Description:ChEMBL_766432
Residue:108
BDBM50198899
NameBDBM50198899
Synonyms:CHEMBL3956710
TypeSmall organic molecule
Emp. Form.C10H4Br2ClNOS2
Mol. Mass.413.536
SMILESClc1cc(Br)c(\C=C2/SC(=S)NC2=O)cc1Br