Reaction Details
TargetC-C chemokine receptor type 5
LigandBDBM50198921
Substrate/Competitorn/a
Meas. Tech.ChEMBL_1621029 (CHEMBL3863312)
IC50<10000±n/a nM
Citation Abeywardane, ACaviness, GChoi, YCogan, DGao, AGoldberg, DHeim-Riether, AJeanfavre, DKlein, EKowalski, JAMao, WMiller, CMoss, NRamsden, PRaymond, ESkow, DSmith-Keenan, LSnow, RJWu, FWu, JPYu, Y N-Arylsulfonyl-a-amino carboxamides are potent and selective inhibitors of the chemokine receptor CCR10 that show efficacy in the murine DNFB model of contact hypersensitivity. Bioorg Med Chem Lett26:5277-5283 (2016) 
 
C-C chemokine receptor type 5
Name:C-C chemokine receptor type 5
Type:Enzyme
Mol. Mass.:40540.21
Organism:Homo sapiens (Human)
Description:P51681
Residue:352
BDBM50198921
NameBDBM50198921
Synonyms:CHEMBL3889627
TypeSmall organic molecule
Emp. Form.C23H27N5O3S
Mol. Mass.453.557
SMILESCC1CCN(CC1)C(=O)C(CCn1cccc1C#N)NS(=O)(=O)c1cccc2[nH]ccc12