Reaction Details
TargetC-C chemokine receptor type 10
LigandBDBM50198915
Substrate/Competitorn/a
Meas. Tech.ChEMBL_1621022 (CHEMBL3863305)
IC50 794±n/a nM
Citation Abeywardane, ACaviness, GChoi, YCogan, DGao, AGoldberg, DHeim-Riether, AJeanfavre, DKlein, EKowalski, JAMao, WMiller, CMoss, NRamsden, PRaymond, ESkow, DSmith-Keenan, LSnow, RJWu, FWu, JPYu, Y N-Arylsulfonyl-a-amino carboxamides are potent and selective inhibitors of the chemokine receptor CCR10 that show efficacy in the murine DNFB model of contact hypersensitivity. Bioorg Med Chem Lett26:5277-5283 (2016) 
 
C-C chemokine receptor type 10
Name:C-C chemokine receptor type 10
Type:PROTEIN
Mol. Mass.:38433.43
Organism:Homo sapiens (Human)
Description:ChEMBL_105617
Residue:362
BDBM50198915
NameBDBM50198915
Synonyms:CHEMBL3908230
TypeSmall organic molecule
Emp. Form.C19H24Cl2N6O5S
Mol. Mass.519.402
SMILESCC1CCN(CC1)C(=O)C(CCn1ccnc1[N+]([O-])=O)NS(=O)(=O)c1cc(Cl)c(N)c(Cl)c1