Reaction Details
TargetAmine oxidase [flavin-containing] B
LigandBDBM50199097
Substrate/Competitorn/a
Meas. Tech.ChEMBL_1621099 (CHEMBL3863382)
IC50 1.3±n/a nM
Citation Wang, ZWu, JYang, XCai, PLiu, QWang, KDGKong, LWang, X Neuroprotective effects of benzyloxy substituted small molecule monoamine oxidase B inhibitors in Parkinson's disease. Bioorg Med Chem24:5929-5940 (2016) 
 
Amine oxidase [flavin-containing] B
Name:Amine oxidase [flavin-containing] B
Type:Protein
Mol. Mass.:58768.76
Organism:Homo sapiens (Human)
Description:P27338
Residue:520
BDBM50199097
NameBDBM50199097
Synonyms:CHEMBL3911291
TypeSmall organic molecule
Emp. Form.C15H13ClO3
Mol. Mass.276.715
SMILESCC(=O)c1ccc(OCc2cccc(Cl)c2)cc1O