Reaction Details
TargetHistone deacetylase 1
LigandBDBM50005711
Substrate/Competitorn/a
Meas. Tech.ChEMBL_1621339 (CHEMBL3863622)
IC50 23±n/a nM
Citation Jadhavar, PSRamachandran, SARiquelme, EGupta, AQuinn, KPShivakumar, DRay, SZende, DNayak, AKMiglani, SKSathe, BDRaja, MFarias, OAlfaro, IBelmar, SGuerrero, JBernales, SChakravarty, SHung, DTLindquist, JNRai, R Targeting prostate cancer with compounds possessing dual activity as androgen receptor antagonists and HDAC6 inhibitors. Bioorg Med Chem Lett26:5222-5228 (2016) 
 
Histone deacetylase 1
Name:Histone deacetylase 1
Type:Enzyme
Mol. Mass.:55090.27
Organism:Homo sapiens (Human)
Description:Q13547
Residue:482
BDBM50005711
NameBDBM50005711
Synonyms:CHEBI:46024 TRICHOSTATIN Trichostatin A (TSA) US10722597, Compound Trichostatin US20230322747, Compound trichostatin A | US9265734, TSA
TypeSmall organic molecule
Emp. Form.C17H22N2O3
Mol. Mass.302.3682
SMILESC[C@H](\C=C(/C)\C=C\C(=O)NO)C(=O)c1ccc(cc1)N(C)C