Reaction Details
TargetAndrogen receptor
LigandBDBM50199118
Substrate/Competitorn/a
Meas. Tech.ChEMBL_1621343 (CHEMBL3863626)
IC50 43±n/a nM
Citation Jadhavar, PSRamachandran, SARiquelme, EGupta, AQuinn, KPShivakumar, DRay, SZende, DNayak, AKMiglani, SKSathe, BDRaja, MFarias, OAlfaro, IBelmar, SGuerrero, JBernales, SChakravarty, SHung, DTLindquist, JNRai, R Targeting prostate cancer with compounds possessing dual activity as androgen receptor antagonists and HDAC6 inhibitors. Bioorg Med Chem Lett26:5222-5228 (2016) 
 
Androgen receptor
Name:Androgen receptor
Type:Receptor
Mol. Mass.:99185.27
Organism:Homo sapiens (Human)
Description:CHO cells were stably transfected with human AR gene.
Residue:920
BDBM50199118
NameBDBM50199118
Synonyms:CHEMBL3894825
TypeSmall organic molecule
Emp. Form.C26H24F4N4O5S
Mol. Mass.580.551
SMILESCC1(C)N(C(=S)N(C1=O)c1ccc(C#N)c(c1)C(F)(F)F)c1ccc(C(=O)OCCCCCC(=O)NO)c(F)c1