Reaction Details
Target5-hydroxytryptamine receptor 7
LigandBDBM50199141
Substrate/Competitorn/a
Meas. Tech.ChEMBL_1621378 (CHEMBL3863661)
Ki 0.500000±n/a nM
Citation Ofori, EZhu, XYEtukala, JRBricker, BAAblordeppey, SY Synthesis and evaluation of the structural elements in alkylated tetrahydroisoquinolines for binding to CNS receptors. Bioorg Med Chem24:5730-5740 (2016) 
 
5-hydroxytryptamine receptor 7
Name:5-hydroxytryptamine receptor 7
Type:G Protein-Coupled Receptor (GPCR)
Mol. Mass.:53573.08
Organism:Homo sapiens (Human)
Description:P34969
Residue:479
BDBM50199141
NameBDBM50199141
Synonyms:CHEMBL3898250
TypeSmall organic molecule
Emp. Form.C20H21Cl2NO
Mol. Mass.362.293
SMILESCl.Clc1ccc2C(=O)C(CCN3CCc4ccccc4C3)Cc2c1