Reaction Details
TargetTransmembrane domain-containing protein TMIGD3
LigandBDBM50199467
Substrate/Competitorn/a
Meas. Tech.ChEMBL_1621587 (CHEMBL3863870)
Ki 24±n/a nM
Citation Tosh, DKCiancetta, AWarnick, ECrane, SGao, ZGJacobson, KA Structure-Based Scaffold Repurposing for G Protein-Coupled Receptors: Transformation of Adenosine Derivatives into 5HT J Med Chem59:11006-11026 (2016) 
 
Transmembrane domain-containing protein TMIGD3
Name:Transmembrane domain-containing protein TMIGD3
Type:PROTEIN
Mol. Mass.:30335.79
Organism:Homo sapiens (Human)
Description:ChEMBL_114868
Residue:266
BDBM50199467
NameBDBM50199467
Synonyms:CHEMBL3985712
TypeSmall organic molecule
Emp. Form.C21H21ClN6O3S
Mol. Mass.472.948
SMILES[H][C@]12C[C@]1([C@@H](O)[C@@H](O)[C@@H]2n1cnc2c(nc(nc12)C#Cc1ccc(Cl)s1)N(C)C)C(=O)NC