Reaction Details
TargetShiga toxin subunit A
LigandBDBM50199477
Substrate/Competitorn/a
Meas. Tech.ChEMBL_1621651 (CHEMBL3863934)
Ki 8780±n/a nM
Citation Chauhan, VChaudhary, DPathak, USaxena, NDhaked, RK In Silico Discovery and Validation of Amide Based Small Molecule Targeting the Enzymatic Site of Shiga Toxin. J Med Chem59:10763-10773 (2016) 
 
Shiga toxin subunit A
Name:Shiga toxin subunit A
Type:PROTEIN
Mol. Mass.:34823.39
Organism:Shigella dysenteriae
Description:ChEMBL_116947
Residue:315
BDBM50199477
NameBDBM50199477
Synonyms:CHEMBL3964948
TypeSmall organic molecule
Emp. Form.C24H16O4
Mol. Mass.368.3814
SMILESO=C(Oc1c(oc2ccccc2c1=O)-c1ccccc1)\C=C\c1ccccc1