Reaction Details
TargetShiga toxin subunit A
LigandBDBM76395
Substrate/Competitorn/a
Meas. Tech.ChEMBL_1621651 (CHEMBL3863934)
Ki 9930±n/a nM
Citation Chauhan, VChaudhary, DPathak, USaxena, NDhaked, RK In Silico Discovery and Validation of Amide Based Small Molecule Targeting the Enzymatic Site of Shiga Toxin. J Med Chem59:10763-10773 (2016) 
 
Shiga toxin subunit A
Name:Shiga toxin subunit A
Type:PROTEIN
Mol. Mass.:34823.39
Organism:Shigella dysenteriae
Description:ChEMBL_116947
Residue:315
BDBM76395
NameBDBM76395
Synonyms:(E)-1-(2-hydroxyphenyl)-3-(4-methoxyphenyl)-2-propen-1-one MLS000438984 cid_5331295
TypeSmall organic molecule
Emp. Form.C16H14O3
Mol. Mass.254.2806
SMILESCOc1ccc(\C=C\C(=O)c2ccccc2O)cc1