Reaction Details
TargetShiga toxin subunit A
LigandBDBM50199614
Substrate/Competitorn/a
Meas. Tech.ChEMBL_1621651 (CHEMBL3863934)
Ki 5960±n/a nM
Citation Chauhan, VChaudhary, DPathak, USaxena, NDhaked, RK In Silico Discovery and Validation of Amide Based Small Molecule Targeting the Enzymatic Site of Shiga Toxin. J Med Chem59:10763-10773 (2016) 
 
Shiga toxin subunit A
Name:Shiga toxin subunit A
Type:PROTEIN
Mol. Mass.:34823.39
Organism:Shigella dysenteriae
Description:ChEMBL_116947
Residue:315
BDBM50199614
NameBDBM50199614
Synonyms:CHEMBL1253710
TypeSmall organic molecule
Emp. Form.C13H10O2S
Mol. Mass.230.282
SMILESOc1ccccc1C(=O)\C=C\c1cccs1