Reaction Details
TargetSodium-dependent dopamine transporter
LigandBDBM50199713
Substrate/Competitorn/a
Meas. Tech.ChEMBL_1621702 (CHEMBL3863985)
Ki 4.5±n/a nM
Citation Cao, JSlack, RDBakare, OMBurzynski, CRais, RSlusher, BSKopajtic, TBonifazi, AEllenberger, MPYano, HHe, YBi, GHXi, ZXLoland, CJNewman, AH Novel and High Affinity 2-[(Diphenylmethyl)sulfinyl]acetamide (Modafinil) Analogues as Atypical Dopamine Transporter Inhibitors. J Med Chem59:10676-10691 (2016) 
 
Sodium-dependent dopamine transporter
Name:Sodium-dependent dopamine transporter
Type:Multi-pass membrane protein
Mol. Mass.:68749.45
Organism:Rattus norvegicus (rat)
Description:P23977
Residue:619
BDBM50199713
NameBDBM50199713
Synonyms:CHEMBL3965237 US11555013, Compound 7b | US9862679, Compound 7b
TypeSmall organic molecule
Emp. Form.C28H32F2N2S
Mol. Mass.466.629
SMILESFc1ccc(cc1)C(SCCN1CCN(CCCc2ccccc2)CC1)c1ccc(F)cc1