Reaction Details
TargetSodium-dependent dopamine transporter
LigandBDBM50199853
Substrate/Competitorn/a
Meas. Tech.ChEMBL_1621702 (CHEMBL3863985)
Ki 7.4±n/a nM
Citation Cao, JSlack, RDBakare, OMBurzynski, CRais, RSlusher, BSKopajtic, TBonifazi, AEllenberger, MPYano, HHe, YBi, GHXi, ZXLoland, CJNewman, AH Novel and High Affinity 2-[(Diphenylmethyl)sulfinyl]acetamide (Modafinil) Analogues as Atypical Dopamine Transporter Inhibitors. J Med Chem59:10676-10691 (2016) 
 
Sodium-dependent dopamine transporter
Name:Sodium-dependent dopamine transporter
Type:Multi-pass membrane protein
Mol. Mass.:68749.45
Organism:Rattus norvegicus (rat)
Description:P23977
Residue:619
BDBM50199853
NameBDBM50199853
Synonyms:CHEMBL3935199
TypeSmall organic molecule
Emp. Form.C26H28F2N2S
Mol. Mass.438.576
SMILESFc1ccc(cc1)C(SCCN1CCN(Cc2ccccc2)CC1)c1ccc(F)cc1