Reaction Details
TargetPhosphatidylinositol 4-kinase beta
LigandBDBM50200108
Substrate/Competitorn/a
Meas. Tech.ChEMBL_1621797 (CHEMBL3864080)
IC50 39±n/a nM
Citation Humpolickova, JMejdrová, IMatousova, MNencka, RBoura, E Fluorescent Inhibitors as Tools To Characterize Enzymes: Case Study of the Lipid Kinase Phosphatidylinositol 4-Kinase IIIß (PI4KB). J Med Chem60:119-127 (2017) 
 
Phosphatidylinositol 4-kinase beta
Name:Phosphatidylinositol 4-kinase beta
Type:Protein
Mol. Mass.:91373.30
Organism:Homo sapiens (Human)
Description:n/a
Residue:816
BDBM50200108
NameBDBM50200108
Synonyms:CHEMBL3966476
TypeSmall organic molecule
Emp. Form.C49H43ClN10O9S
Mol. Mass.983.445
SMILESCCc1cc(CNc2cc(Cl)nn3c(c(C)nc23)-c2ccc(OC)c(c2)S(=O)(=O)NCc2cn(CCCNC(=O)c3ccc4C(=O)OC5(c4c3)c3ccc(O)cc3Oc3cc(O)ccc53)nn2)ccn1