Reaction Details
TargetPhosphatidylinositol 4-kinase beta
LigandBDBM50200109
Substrate/Competitorn/a
Meas. Tech.ChEMBL_1621797 (CHEMBL3864080)
IC50 13±n/a nM
Citation Humpolickova, JMejdrová, IMatousova, MNencka, RBoura, E Fluorescent Inhibitors as Tools To Characterize Enzymes: Case Study of the Lipid Kinase Phosphatidylinositol 4-Kinase IIIß (PI4KB). J Med Chem60:119-127 (2017) 
 
Phosphatidylinositol 4-kinase beta
Name:Phosphatidylinositol 4-kinase beta
Type:Protein
Mol. Mass.:91373.30
Organism:Homo sapiens (Human)
Description:n/a
Residue:816
BDBM50200109
NameBDBM50200109
Synonyms:CHEMBL3974986
TypeSmall organic molecule
Emp. Form.C25H25ClN6O3S
Mol. Mass.525.022
SMILESCCc1cc(CNc2cc(Cl)nn3c(c(C)nc23)-c2ccc(OC)c(c2)S(=O)(=O)NCC#C)ccn1