Reaction Details
TargetPhosphatidylinositol 4-kinase beta
LigandBDBM50200107
Substrate/Competitorn/a
Meas. Tech.ChEMBL_1621797 (CHEMBL3864080)
IC50 76±n/a nM
Citation Humpolickova, JMejdrová, IMatousova, MNencka, RBoura, E Fluorescent Inhibitors as Tools To Characterize Enzymes: Case Study of the Lipid Kinase Phosphatidylinositol 4-Kinase IIIß (PI4KB). J Med Chem60:119-127 (2017) 
 
Phosphatidylinositol 4-kinase beta
Name:Phosphatidylinositol 4-kinase beta
Type:Protein
Mol. Mass.:91373.30
Organism:Homo sapiens (Human)
Description:n/a
Residue:816
BDBM50200107
NameBDBM50200107
Synonyms:CHEMBL3963020
TypeSmall organic molecule
Emp. Form.C34H30ClN9O6S
Mol. Mass.728.177
SMILESCCc1cc(CNc2cc(Cl)nn3c(c(C)nc23)-c2ccc(OC)c(c2)S(=O)(=O)NCc2cn(nn2)-c2cc3ccc(O)cc3oc2=O)ccn1