Reaction Details
TargetBromodomain-containing protein 4
LigandBDBM50200378
Substrate/Competitorn/a
Meas. Tech.ChEBML_1622038
IC50 7700±n/a nM
Citation Crawford, TDRomero, FALai, KWTsui, VTaylor, AMde Leon Boenig, GNoland, CLMurray, JLy, JChoo, EFHunsaker, TLChan, EWMerchant, MKharbanda, SGascoigne, KEKaufman, SBeresini, MHLiao, JLiu, WChen, KXChen, ZConery, ARCôté, AJayaram, HJiang, YKiefer, JRKleinheinz, TLi, YMaher, JPardo, EPoy, FSpillane, KLWang, FWang, JWei, XXu, ZXu, ZYen, IZawadzke, LZhu, XBellon, SCummings, RCochran, AGAlbrecht, BKMagnuson, S Discovery of a Potent and Selective in Vivo Probe (GNE-272) for the Bromodomains of CBP/EP300. J Med Chem59:10549-10563 (2016) 
 
Bromodomain-containing protein 4
Name:Bromodomain-containing protein 4
Type:Protein
Mol. Mass.:152264.84
Organism:Homo sapiens (Human)
Description:O60885
Residue:1362
BDBM50200378
NameBDBM50200378
Synonyms:CHEMBL3906525
TypeSmall organic molecule
Emp. Form.C21H27N5O2
Mol. Mass.381.4714
SMILESCCNC(=O)c1cccc(Nc2nn(CC3CC3)c3CCN(Cc23)C(C)=O)c1