Reaction Details
TargetCREB-binding protein/Histone acetyltransferase p300
LigandBDBM50200430
Substrate/Competitorn/a
Meas. Tech.ChEMBL_1622040 (CHEMBL3864392)
IC50 500±n/a nM
Citation Crawford, TDRomero, FALai, KWTsui, VTaylor, AMde Leon Boenig, GNoland, CLMurray, JLy, JChoo, EFHunsaker, TLChan, EWMerchant, MKharbanda, SGascoigne, KEKaufman, SBeresini, MHLiao, JLiu, WChen, KXChen, ZConery, ARCôté, AJayaram, HJiang, YKiefer, JRKleinheinz, TLi, YMaher, JPardo, EPoy, FSpillane, KLWang, FWang, JWei, XXu, ZXu, ZYen, IZawadzke, LZhu, XBellon, SCummings, RCochran, AGAlbrecht, BKMagnuson, S Discovery of a Potent and Selective in Vivo Probe (GNE-272) for the Bromodomains of CBP/EP300. J Med Chem59:10549-10563 (2016) 
 
CREB-binding protein/Histone acetyltransferase p300
Name:CREB-binding protein/Histone acetyltransferase p300
Synonyms:n/a
Type:n/a
Mol. Mass.:n/a
Description:ASSAY_ID of ChEMBL is 2168996
Components:This complex has 2 components.
Component 1
Name:Histone acetyltransferase p300
Type:Protein
Mol. Mass.:264223.04
Organism:Homo sapiens (Human)
Description:Q09472
Residue:2414
Component 2
Name:CREB-binding protein
Synonyms:CBP CREB-binding protein (CBP) CREBBP
Type:Transcription Coactivator
Mol. Mass.:265411.66
Organism:Homo sapiens (Human)
Description:Q92793
Residue:2442
BDBM50200430
NameBDBM50200430
Synonyms:CHEMBL3893541 | US9763922, Example 63
TypeSmall organic molecule
Emp. Form.C23H25N5O
Mol. Mass.387.4775
SMILESCC(=O)N1CCc2c(C1)c(Nc1cccc(c1)-c1cccnc1)nn2CC1CC1