Reaction Details
TargetBromodomain-containing protein 4
LigandBDBM50200446
Substrate/Competitorn/a
Meas. Tech.ChEMBL_1622038 (CHEMBL3864390)
IC50>20000±n/a nM
Citation Crawford, TDRomero, FALai, KWTsui, VTaylor, AMde Leon Boenig, GNoland, CLMurray, JLy, JChoo, EFHunsaker, TLChan, EWMerchant, MKharbanda, SGascoigne, KEKaufman, SBeresini, MHLiao, JLiu, WChen, KXChen, ZConery, ARCôté, AJayaram, HJiang, YKiefer, JRKleinheinz, TLi, YMaher, JPardo, EPoy, FSpillane, KLWang, FWang, JWei, XXu, ZXu, ZYen, IZawadzke, LZhu, XBellon, SCummings, RCochran, AGAlbrecht, BKMagnuson, S Discovery of a Potent and Selective in Vivo Probe (GNE-272) for the Bromodomains of CBP/EP300. J Med Chem59:10549-10563 (2016) 
 
Bromodomain-containing protein 4
Name:Bromodomain-containing protein 4
Type:Protein
Mol. Mass.:152264.84
Organism:Homo sapiens (Human)
Description:O60885
Residue:1362
BDBM50200446
NameBDBM50200446
Synonyms:CHEMBL3947092
TypeSmall organic molecule
Emp. Form.C14H15FN4O
Mol. Mass.274.2935
SMILESCC(=O)N1CCc2[nH]nc(Nc3ccc(F)cc3)c2C1