Reaction Details
TargetCREB-binding protein
LigandBDBM188519
Substrate/Competitorn/a
Meas. Tech.ChEMBL_1622032 (CHEMBL3864384)
IC50 30±n/a nM
Citation Crawford, TDRomero, FALai, KWTsui, VTaylor, AMde Leon Boenig, GNoland, CLMurray, JLy, JChoo, EFHunsaker, TLChan, EWMerchant, MKharbanda, SGascoigne, KEKaufman, SBeresini, MHLiao, JLiu, WChen, KXChen, ZConery, ARCôté, AJayaram, HJiang, YKiefer, JRKleinheinz, TLi, YMaher, JPardo, EPoy, FSpillane, KLWang, FWang, JWei, XXu, ZXu, ZYen, IZawadzke, LZhu, XBellon, SCummings, RCochran, AGAlbrecht, BKMagnuson, S Discovery of a Potent and Selective in Vivo Probe (GNE-272) for the Bromodomains of CBP/EP300. J Med Chem59:10549-10563 (2016) 
 
CREB-binding protein
Name:CREB-binding protein
Type:Transcription Coactivator
Mol. Mass.:265411.66
Organism:Homo sapiens (Human)
Description:Q92793
Residue:2442
BDBM188519
NameBDBM188519
Synonyms:SGC-CBP30
TypeSmall organic molecule
Emp. Form.C28H33ClN4O3
Mol. Mass.509.04
SMILESCOc1ccc(CCc2nc3cc(ccc3n2C[C@H](C)N2CCOCC2)-c2c(C)noc2C)cc1Cl